Reaction Details
Target4-hydroxyphenylpyruvate dioxygenase
LigandBDBM50024722
Substrate/Competitorn/a
Meas. Tech.ChEMBL_1438115 (CHEMBL3388490)
Ki 20±n/a nM
Citation Xu, YLLin, HYCao, RJMing, ZZYang, WCYang, GF Pyrazolone-quinazolone hybrids: a novel class of human 4-hydroxyphenylpyruvate dioxygenase inhibitors. Bioorg Med Chem22:5194-211 (2014) 
 
4-hydroxyphenylpyruvate dioxygenase
Name:4-hydroxyphenylpyruvate dioxygenase
Type:PROTEIN
Mol. Mass.:44937.33
Organism:Homo sapiens (Human)
Description:ChEMBL_123
Residue:393
BDBM50024722
NameBDBM50024722
Synonyms:CHEMBL3342602
TypeSmall organic molecule
Emp. Form.C20H15FN4O3
Mol. Mass.378.3565
SMILESCc1nc2ccc(cc2c(=O)n1-c1cccc(F)c1)C(=O)c1cnn(C)c1O