Reaction Details
Target4-hydroxyphenylpyruvate dioxygenase
LigandBDBM50024731
Substrate/Competitorn/a
Meas. Tech.ChEMBL_1438115 (CHEMBL3388490)
Ki 87±n/a nM
Citation Xu, YLLin, HYCao, RJMing, ZZYang, WCYang, GF Pyrazolone-quinazolone hybrids: a novel class of human 4-hydroxyphenylpyruvate dioxygenase inhibitors. Bioorg Med Chem22:5194-211 (2014) 
 
4-hydroxyphenylpyruvate dioxygenase
Name:4-hydroxyphenylpyruvate dioxygenase
Type:PROTEIN
Mol. Mass.:44937.33
Organism:Homo sapiens (Human)
Description:ChEMBL_123
Residue:393
BDBM50024731
NameBDBM50024731
Synonyms:CHEMBL3342428
TypeSmall organic molecule
Emp. Form.C22H19BrN4O3
Mol. Mass.467.315
SMILESCc1nn(C)c(O)c1C(=O)c1ccc2nc(C)n(-c3ccc(C)cc3Br)c(=O)c2c1