Reaction Details
Target4-hydroxyphenylpyruvate dioxygenase
LigandBDBM50024742
Substrate/Competitorn/a
Meas. Tech.ChEMBL_1438115 (CHEMBL3388490)
Ki 173±n/a nM
Citation Xu, YLLin, HYCao, RJMing, ZZYang, WCYang, GF Pyrazolone-quinazolone hybrids: a novel class of human 4-hydroxyphenylpyruvate dioxygenase inhibitors. Bioorg Med Chem22:5194-211 (2014) 
 
4-hydroxyphenylpyruvate dioxygenase
Name:4-hydroxyphenylpyruvate dioxygenase
Type:PROTEIN
Mol. Mass.:44937.33
Organism:Homo sapiens (Human)
Description:ChEMBL_123
Residue:393
BDBM50024742
NameBDBM50024742
Synonyms:CHEMBL3342417
TypeSmall organic molecule
Emp. Form.C21H17ClN4O3
Mol. Mass.408.838
SMILESCc1nn(C)c(O)c1C(=O)c1ccc2nc(C)n(-c3cccc(Cl)c3)c(=O)c2c1