Reaction Details
Target4-hydroxyphenylpyruvate dioxygenase
LigandBDBM50024755
Substrate/Competitorn/a
Meas. Tech.ChEMBL_1438115 (CHEMBL3388490)
Ki 160±n/a nM
Citation Xu, YLLin, HYCao, RJMing, ZZYang, WCYang, GF Pyrazolone-quinazolone hybrids: a novel class of human 4-hydroxyphenylpyruvate dioxygenase inhibitors. Bioorg Med Chem22:5194-211 (2014) 
 
4-hydroxyphenylpyruvate dioxygenase
Name:4-hydroxyphenylpyruvate dioxygenase
Type:PROTEIN
Mol. Mass.:44937.33
Organism:Homo sapiens (Human)
Description:ChEMBL_123
Residue:393
BDBM50024755
NameBDBM50024755
Synonyms:CHEMBL3342613
TypeSmall organic molecule
Emp. Form.C21H15F3N4O4
Mol. Mass.444.3634
SMILESCc1nc2ccc(cc2c(=O)n1-c1ccc(OC(F)(F)F)cc1)C(=O)c1cnn(C)c1O