Reaction Details
TargetCollagenase 3
LigandBDBM50025182
Substrate/Competitorn/a
Meas. Tech.ChEMBL_1442057 (CHEMBL3373425)
IC50 0.080000±n/a nM
Citation Nara, HSato, KNaito, TMototani, HOki, HYamamoto, YKuno, HSantou, TKanzaki, NTerauchi, JUchikawa, OKori, M Thieno[2,3-d]pyrimidine-2-carboxamides bearing a carboxybenzene group at 5-position: highly potent, selective, and orally available MMP-13 inhibitors interacting with the S1¿ binding site. Bioorg Med Chem22:5487-505 (2014) 
 
Collagenase 3
Name:Collagenase 3
Type:Enzyme
Mol. Mass.:53808.06
Organism:Homo sapiens (Human)
Description:P45452
Residue:471
BDBM50025182
NameBDBM50025182
Synonyms:CHEMBL3337890
TypeSmall organic molecule
Emp. Form.C25H25N3O5S
Mol. Mass.479.548
SMILESCOCc1ccc(COCc2csc3nc([nH]c(=O)c23)C(=O)NCc2cccc(OC)c2)cc1