Reaction Details
TargetCollagenase 3
LigandBDBM50025193
Substrate/Competitorn/a
Meas. Tech.ChEMBL_1442057 (CHEMBL3373425)
IC50 0.053000±n/a nM
Citation Nara, HSato, KNaito, TMototani, HOki, HYamamoto, YKuno, HSantou, TKanzaki, NTerauchi, JUchikawa, OKori, M Thieno[2,3-d]pyrimidine-2-carboxamides bearing a carboxybenzene group at 5-position: highly potent, selective, and orally available MMP-13 inhibitors interacting with the S1¿ binding site. Bioorg Med Chem22:5487-505 (2014) 
 
Collagenase 3
Name:Collagenase 3
Type:Enzyme
Mol. Mass.:53808.06
Organism:Homo sapiens (Human)
Description:P45452
Residue:471
BDBM50025193
NameBDBM50025193
Synonyms:CHEMBL3337902
TypeSmall organic molecule
Emp. Form.C23H20N4O4S
Mol. Mass.448.494
SMILESCOc1cccc(CNC(=O)c2nc3scc(NC(=O)Cc4ccccc4)c3c(=O)[nH]2)c1