Reaction Details
TargetSodium-dependent serotonin transporter
LigandBDBM50024210
Substrate/Competitorn/a
Meas. Tech.ChEMBL_1442872 (CHEMBL3377150)
EC50 33±n/a nM
Citation Blough, BELandavazo, APartilla, JSDecker, AMPage, KMBaumann, MHRothman, RB Alpha-ethyltryptamines as dual dopamine-serotonin releasers. Bioorg Med Chem Lett24:4754-8 (2014) 
 
Sodium-dependent serotonin transporter
Name:Sodium-dependent serotonin transporter
Type:Multi-pass membrane protein
Mol. Mass.:70168.43
Organism:Rattus norvegicus (rat)
Description:P31652
Residue:630
BDBM50024210
NameBDBM50024210
Synonyms:1H-indole-3-ethanamine 2-(3-indolyl)ethylamine tryptamine
TypeSmall organic molecule
Emp. Form.C10H12N2
Mol. Mass.160.2157
SMILESNCCc1c[nH]c2ccccc12