Reaction Details
TargetPlatelet-derived growth factor receptor alpha/beta
LigandBDBM50026673
Substrate/Competitorn/a
Meas. Tech.ChEMBL_1436093 (CHEMBL3384724)
IC50<10.0±n/a nM
Citation Subramanian, SCostales, AWilliams, TELevine, BMcBride, CMPoon, DAmiri, PRenhowe, PAShafer, CMStuart, DVerhagen, JRamurthy, S Design and Synthesis of Orally Bioavailable Benzimidazole Reverse Amides as Pan RAF Kinase Inhibitors. ACS Med Chem Lett5:989-92 (2014) 
 
Platelet-derived growth factor receptor alpha/beta
Name:Platelet-derived growth factor receptor alpha/beta
Type:n/a
Mol. Mass.:n/a
Description:ASSAY_ID of EBI is 29498
Components:This complex has 2 components.
Component 1
Name:Platelet-derived growth factor receptor beta
Synonyms:Beta-type platelet-derived growth factor receptor CD140b antigen PDGF Receptor Substrate PDGFR PDGFR-1 PDGFRB PGFRB_HUMAN Platelet-derived growth factor receptor 1 Platelet-derived growth factor receptor beta (PDGFR-beta) Platelet-derived growth factor receptor beta (PDGFRbeta) | VHL/PDGFRB
Type:Enzyme
Mol. Mass.:123922.25
Organism:Homo sapiens (Human)
Description:P09619
Residue:1106
Component 2
Name:Platelet-derived growth factor receptor alpha
Synonyms:Alpha-type platelet-derived growth factor receptor PDGFRA PGFRA_HUMAN Platelet-derived growth factor receptor alpha (PDGFRA) RHEPDGFRA
Type:Protein
Mol. Mass.:122633.38
Organism:Homo sapiens (Human)
Description:P16234
Residue:1089
BDBM50026673
NameBDBM50026673
Synonyms:CHEMBL3335387
TypeSmall organic molecule
Emp. Form.C28H29F4N7O2
Mol. Mass.571.5692
SMILESCCN1CCN(CC(=O)Nc2cc(Oc3ccc4n(C)c(Nc5cc(ccc5F)C(F)(F)F)nc4c3)ccn2)CC1