Reaction Details
TargetSerine/threonine-protein kinase B-raf
LigandBDBM50026692
Substrate/Competitorn/a
Meas. Tech.ChEMBL_1436082 (CHEMBL3384713)
IC50 1.000000±n/a nM
Citation Subramanian, SCostales, AWilliams, TELevine, BMcBride, CMPoon, DAmiri, PRenhowe, PAShafer, CMStuart, DVerhagen, JRamurthy, S Design and Synthesis of Orally Bioavailable Benzimidazole Reverse Amides as Pan RAF Kinase Inhibitors. ACS Med Chem Lett5:989-92 (2014) 
 
Serine/threonine-protein kinase B-raf
Name:Serine/threonine-protein kinase B-raf
Type:Serine/threonine-protein kinase
Mol. Mass.:84446.00
Organism:Homo sapiens (Human)
Description:P15056
Residue:766
BDBM50026692
NameBDBM50026692
Synonyms:CHEMBL3335381
TypeSmall organic molecule
Emp. Form.C22H17F4N5O2
Mol. Mass.459.3963
SMILESCC(=O)Nc1cc(Oc2ccc3n(C)c(Nc4cc(ccc4F)C(F)(F)F)nc3c2)ccn1