Reaction Details
TargetCytochrome P450 1A2
LigandBDBM50014323
Substrate/Competitorn/a
Meas. Tech.ChEMBL_1436759 (CHEMBL3385971)
IC50 32600±n/a nM
Citation Han, MSong, CJeong, NHahn, HG Exploration of 3-Aminoazetidines as Triple Reuptake Inhibitors by Bioisosteric Modification of 3-a-Oxyazetidine. ACS Med Chem Lett5:999-1004 (2014) 
 
Cytochrome P450 1A2
Name:Cytochrome P450 1A2
Type:Enzyme
Mol. Mass.:58423.38
Organism:Homo sapiens (Human)
Description:P05177
Residue:516
BDBM50014323
NameBDBM50014323
Synonyms:2-PHENYL-4H-BENZO[H]CHROMEN-4-ONE 7,8-Benzoflavone alpha-naphthoflavone
TypeSmall organic molecule
Emp. Form.C19H12O2
Mol. Mass.272.2974
SMILESO=c1cc(oc2c3ccccc3ccc12)-c1ccccc1