Reaction Details
TargetCytochrome P450 2D6
LigandBDBM50410855
Substrate/Competitorn/a
Meas. Tech.ChEMBL_1436760 (CHEMBL3385972)
IC50 25100±n/a nM
Citation Han, MSong, CJeong, NHahn, HG Exploration of 3-Aminoazetidines as Triple Reuptake Inhibitors by Bioisosteric Modification of 3-a-Oxyazetidine. ACS Med Chem Lett5:999-1004 (2014) 
 
Cytochrome P450 2D6
Name:Cytochrome P450 2D6
Type:Protein
Mol. Mass.:55774.82
Organism:Homo sapiens (Human)
Description:P10635
Residue:497
BDBM50410855
NameBDBM50410855
Synonyms:CIN-QUIN QUINIDINE SULFATE
TypeSmall organic molecule
Emp. Form.C20H24N2O2
Mol. Mass.324.4168
SMILESCOc1ccc2nccc([C@H](O)[C@H]3CC4CCN3C[C@@H]4C=C)c2c1