Reaction Details
TargetSodium-dependent serotonin transporter
LigandBDBM84745
Substrate/Competitorn/a
Meas. Tech.ChEMBL_1436754 (CHEMBL3385966)
IC50 515±n/a nM
Citation Han, MSong, CJeong, NHahn, HG Exploration of 3-Aminoazetidines as Triple Reuptake Inhibitors by Bioisosteric Modification of 3-a-Oxyazetidine. ACS Med Chem Lett5:999-1004 (2014) 
 
Sodium-dependent serotonin transporter
Name:Sodium-dependent serotonin transporter
Type:Multi-pass membrane protein
Mol. Mass.:70322.51
Organism:Homo sapiens (Human)
Description:P31645
Residue:630
BDBM84745
NameBDBM84745
Synonyms:CAS_136434-34-9 LY-248686 USRE49340, Rank 5
TypeSmall organic molecule
Emp. Form.C18H19NOS
Mol. Mass.297.415
SMILESCNCC[C@H](Oc1cccc2ccccc12)c1cccs1