Reaction Details
TargetThromboxane A2 receptor
LigandBDBM50026749
Substrate/Competitorn/a
Meas. Tech.ChEMBL_1437451 (CHEMBL3387261)
IC50 2760±n/a nM
Citation Wang, XLiu, LHuang, LHerbst-Robinson, KCornec, ASJames, MJSugiyama, SBassetto, MBrancale, ATrojanowski, JQLee, VMSmith, ABBrunden, KRBallatore, C Potent, long-acting cyclopentane-1,3-Dione thromboxane (A2)-receptor antagonists. ACS Med Chem Lett5:1015-20 (2014) 
 
Thromboxane A2 receptor
Name:Thromboxane A2 receptor
Type:Enyzme
Mol. Mass.:37445.28
Organism:Homo sapiens (Human)
Description:P21731
Residue:343
BDBM50026749
NameBDBM50026749
Synonyms:CHEMBL3354617
TypeSmall organic molecule
Emp. Form.C34H38ClNO4S
Mol. Mass.592.188
SMILESCC(C)COC1=C(C(=O)C(Cc2cccc3CC(CCc23)NS(=O)(=O)c2ccc(Cl)cc2)C1)c1c(C)cccc1C