Reaction Details
TargetcGMP-inhibited 3',5'-cyclic phosphodiesterase 3B
LigandBDBM50026821
Substrate/Competitorn/a
Meas. Tech.ChEMBL_1438243 (CHEMBL3390275)
IC50>10000±n/a nM
Citation Buijnsters, PDe Angelis, MLanglois, XRombouts, FJSanderson, WTresadern, GRitchie, ATrabanco, AAVanHoof, GRoosbroeck, YVAndrés, JI Structure-Based Design of a Potent, Selective, and Brain Penetrating PDE2 Inhibitor with Demonstrated Target Engagement. ACS Med Chem Lett5:1049-53 (2014) 
 
cGMP-inhibited 3',5'-cyclic phosphodiesterase 3B
Name:cGMP-inhibited 3',5'-cyclic phosphodiesterase 3B
Type:Enzyme
Mol. Mass.:124318.95
Organism:Homo sapiens (Human)
Description:PDE3B was generated from the full-length recombinant human clone transfected into Sf9 cells.
Residue:1112
BDBM50026821
NameBDBM50026821
Synonyms:CHEMBL3331521 US9669035, B-1b
TypeSmall organic molecule
Emp. Form.C24H28N6O2
Mol. Mass.432.5181
SMILESCCCCOc1cncc(c1)-c1nnc2c(C)nc3ccc(CN4CCOCC4)cc3n12