Reaction Details
TargetD(3) dopamine receptor
LigandBDBM50027072
Substrate/Competitorn/a
Meas. Tech.ChEMBL_1439004 (CHEMBL3383111)
Ki 10800±n/a nM
Citation Berry, CBBubser, MJones, CKHayes, JPWepy, JALocuson, CWDaniels, JSLindsley, CWHopkins, CR Discovery and Characterization of ML398, a Potent and Selective Antagonist of the D4 Receptor with in Vivo Activity. ACS Med Chem Lett5:1060-4 (2014) 
 
D(3) dopamine receptor
Name:D(3) dopamine receptor
Type:n/a
Mol. Mass.:44243.43
Organism:Homo sapiens (Human)
Description:n/a
Residue:400
BDBM50027072
NameBDBM50027072
Synonyms:CHEMBL3335535
TypeSmall organic molecule
Emp. Form.C20H23N3O
Mol. Mass.321.4161
SMILESC(Cc1ccccc1)C1CN(Cc2nc3ccccc3[nH]2)CCO1