Reaction Details
TargetCytochrome P450 2D6
LigandBDBM50027083
Substrate/Competitorn/a
Meas. Tech.ChEMBL_1439019 (CHEMBL3383666)
IC50 12000±n/a nM
Citation Berry, CBBubser, MJones, CKHayes, JPWepy, JALocuson, CWDaniels, JSLindsley, CWHopkins, CR Discovery and Characterization of ML398, a Potent and Selective Antagonist of the D4 Receptor with in Vivo Activity. ACS Med Chem Lett5:1060-4 (2014) 
 
Cytochrome P450 2D6
Name:Cytochrome P450 2D6
Type:Protein
Mol. Mass.:55774.82
Organism:Homo sapiens (Human)
Description:P10635
Residue:497
BDBM50027083
NameBDBM50027083
Synonyms:CHEMBL3335556
TypeSmall organic molecule
Emp. Form.C19H22ClNO
Mol. Mass.315.837
SMILESClc1ccc(CN2CCO[C@H](CCc3ccccc3)C2)cc1