Reaction Details
TargetD(3) dopamine receptor
LigandBDBM50027081
Substrate/Competitorn/a
Meas. Tech.ChEMBL_1439004 (CHEMBL3383111)
IC50 8170±n/a nM
Citation Berry, CBBubser, MJones, CKHayes, JPWepy, JALocuson, CWDaniels, JSLindsley, CWHopkins, CR Discovery and Characterization of ML398, a Potent and Selective Antagonist of the D4 Receptor with in Vivo Activity. ACS Med Chem Lett5:1060-4 (2014) 
 
D(3) dopamine receptor
Name:D(3) dopamine receptor
Type:n/a
Mol. Mass.:44243.43
Organism:Homo sapiens (Human)
Description:n/a
Residue:400
BDBM50027081
NameBDBM50027081
Synonyms:CHEMBL3335555
TypeSmall organic molecule
Emp. Form.C19H23NO2
Mol. Mass.297.3914
SMILESOc1ccc(CN2CCO[C@H](CCc3ccccc3)C2)cc1