Reaction Details
TargetSphingosine 1-phosphate receptor 1
LigandBDBM50027925
Substrate/Competitorn/a
Meas. Tech.ChEMBL_1436858 (CHEMBL3387231)
EC50 46±n/a nM
Citation Horan, JCSanyal, SChoi, YHill-Drzewi, MPatnaude, LAnderson, SFogal, SMao, CCook, BNGueneva-Boucheva, KFisher, MBHickey, EPack, EBannen, LCChan, DSMac, MBNg, SMWang, YXu, WModis, LKLemieux, RM Piperazinyl-oxadiazoles as selective sphingosine-1-phosphate receptor agonists. Bioorg Med Chem Lett24:4807-11 (2014) 
 
Sphingosine 1-phosphate receptor 1
Name:Sphingosine 1-phosphate receptor 1
Type:Enzyme
Mol. Mass.:42836.02
Organism:Homo sapiens (Human)
Description:P21453
Residue:382
BDBM50027925
NameBDBM50027925
Synonyms:CHEMBL3344408
TypeSmall organic molecule
Emp. Form.C21H29ClFN5O4
Mol. Mass.469.937
SMILESCCC(C)(C)C(=O)N1CCN(CC1)c1noc(n1)-c1cc(F)c(OCC(N)CO)cc1Cl