Reaction Details
TargetSphingosine 1-phosphate receptor 1
LigandBDBM50027932
Substrate/Competitorn/a
Meas. Tech.ChEMBL_1436858 (CHEMBL3387231)
EC50 9.8±n/a nM
Citation Horan, JCSanyal, SChoi, YHill-Drzewi, MPatnaude, LAnderson, SFogal, SMao, CCook, BNGueneva-Boucheva, KFisher, MBHickey, EPack, EBannen, LCChan, DSMac, MBNg, SMWang, YXu, WModis, LKLemieux, RM Piperazinyl-oxadiazoles as selective sphingosine-1-phosphate receptor agonists. Bioorg Med Chem Lett24:4807-11 (2014) 
 
Sphingosine 1-phosphate receptor 1
Name:Sphingosine 1-phosphate receptor 1
Type:Enzyme
Mol. Mass.:42836.02
Organism:Homo sapiens (Human)
Description:P21453
Residue:382
BDBM50027932
NameBDBM50027932
Synonyms:CHEMBL3344413
TypeSmall organic molecule
Emp. Form.C20H24ClF4N5O4
Mol. Mass.509.882
SMILESCC(C)(C(=O)N1CCN(CC1)c1noc(n1)-c1cc(F)c(OC[C@@H](N)CO)cc1Cl)C(F)(F)F