Reaction Details
TargetSphingosine 1-phosphate receptor 1
LigandBDBM50027953
Substrate/Competitorn/a
Meas. Tech.ChEMBL_1436858 (CHEMBL3387231)
EC50>10000±n/a nM
Citation Horan, JCSanyal, SChoi, YHill-Drzewi, MPatnaude, LAnderson, SFogal, SMao, CCook, BNGueneva-Boucheva, KFisher, MBHickey, EPack, EBannen, LCChan, DSMac, MBNg, SMWang, YXu, WModis, LKLemieux, RM Piperazinyl-oxadiazoles as selective sphingosine-1-phosphate receptor agonists. Bioorg Med Chem Lett24:4807-11 (2014) 
 
Sphingosine 1-phosphate receptor 1
Name:Sphingosine 1-phosphate receptor 1
Type:Enzyme
Mol. Mass.:42836.02
Organism:Homo sapiens (Human)
Description:P21453
Residue:382
BDBM50027953
NameBDBM50027953
Synonyms:CHEMBL3344433
TypeSmall organic molecule
Emp. Form.C21H24ClFN4O5
Mol. Mass.466.89
SMILESCC1(C)CC(C1)C(=O)N1CCN(CC1)c1noc(n1)-c1cc(F)c(OCC(O)=O)cc1Cl