Reaction Details
TargetSphingosine 1-phosphate receptor 3
LigandBDBM50027930
Substrate/Competitorn/a
Meas. Tech.ChEMBL_1436859 (CHEMBL3387232)
EC50>10000±n/a nM
Citation Horan, JCSanyal, SChoi, YHill-Drzewi, MPatnaude, LAnderson, SFogal, SMao, CCook, BNGueneva-Boucheva, KFisher, MBHickey, EPack, EBannen, LCChan, DSMac, MBNg, SMWang, YXu, WModis, LKLemieux, RM Piperazinyl-oxadiazoles as selective sphingosine-1-phosphate receptor agonists. Bioorg Med Chem Lett24:4807-11 (2014) 
 
Sphingosine 1-phosphate receptor 3
Name:Sphingosine 1-phosphate receptor 3
Type:G Protein-Coupled Receptor (GPCR)
Mol. Mass.:42278.13
Organism:Homo sapiens (Human)
Description:Q99500
Residue:378
BDBM50027930
NameBDBM50027930
Synonyms:CHEMBL3344411
TypeSmall organic molecule
Emp. Form.C21H27ClFN5O4
Mol. Mass.467.922
SMILESN[C@H](CO)COc1cc(Cl)c(cc1F)-c1nc(no1)N1CCN(CC1)C(=O)C1CCCC1