Reaction Details
TargetSphingosine 1-phosphate receptor 3
LigandBDBM50027956
Substrate/Competitorn/a
Meas. Tech.ChEMBL_1436859 (CHEMBL3387232)
EC50>10000±n/a nM
Citation Horan, JCSanyal, SChoi, YHill-Drzewi, MPatnaude, LAnderson, SFogal, SMao, CCook, BNGueneva-Boucheva, KFisher, MBHickey, EPack, EBannen, LCChan, DSMac, MBNg, SMWang, YXu, WModis, LKLemieux, RM Piperazinyl-oxadiazoles as selective sphingosine-1-phosphate receptor agonists. Bioorg Med Chem Lett24:4807-11 (2014) 
 
Sphingosine 1-phosphate receptor 3
Name:Sphingosine 1-phosphate receptor 3
Type:G Protein-Coupled Receptor (GPCR)
Mol. Mass.:42278.13
Organism:Homo sapiens (Human)
Description:Q99500
Residue:378
BDBM50027956
NameBDBM50027956
Synonyms:CHEMBL3344436
TypeSmall organic molecule
Emp. Form.C23H27ClFN5O4
Mol. Mass.491.943
SMILESOC(=O)C1CN(Cc2cc(Cl)c(cc2F)-c2nc(no2)N2CCN(CC2)C(=O)C2CCCC2)C1