Reaction Details
TargetSphingosine 1-phosphate receptor 3
LigandBDBM50027957
Substrate/Competitorn/a
Meas. Tech.ChEMBL_1436859 (CHEMBL3387232)
EC50 940±n/a nM
Citation Horan, JCSanyal, SChoi, YHill-Drzewi, MPatnaude, LAnderson, SFogal, SMao, CCook, BNGueneva-Boucheva, KFisher, MBHickey, EPack, EBannen, LCChan, DSMac, MBNg, SMWang, YXu, WModis, LKLemieux, RM Piperazinyl-oxadiazoles as selective sphingosine-1-phosphate receptor agonists. Bioorg Med Chem Lett24:4807-11 (2014) 
 
Sphingosine 1-phosphate receptor 3
Name:Sphingosine 1-phosphate receptor 3
Type:G Protein-Coupled Receptor (GPCR)
Mol. Mass.:42278.13
Organism:Homo sapiens (Human)
Description:Q99500
Residue:378
BDBM50027957
NameBDBM50027957
Synonyms:CHEMBL3341785
TypeSmall organic molecule
Emp. Form.C21H28ClFN5O7P
Mol. Mass.547.901
SMILESN[C@H](COc1cc(Cl)c(cc1F)-c1nc(no1)N1CCN(CC1)C(=O)C1CCCC1)COP(O)(O)=O