Reaction Details
TargetCytochrome b-c1 complex subunit 7
LigandBDBM50028009
Substrate/Competitorn/a
Meas. Tech.ChEMBL_1436866 (CHEMBL3387788)
IC50>20000±n/a nM
Citation Jung, HJCho, MKim, YHan, GKwon, HJ Development of a novel class of mitochondrial ubiquinol-cytochrome c reductase binding protein (UQCRB) modulators as promising antiangiogenic leads. J Med Chem57:7990-8 (2014) 
 
Cytochrome b-c1 complex subunit 7
Name:Cytochrome b-c1 complex subunit 7
Type:PROTEIN
Mol. Mass.:13532.80
Organism:Homo sapiens (Human)
Description:ChEMBL_103899
Residue:111
BDBM50028009
NameBDBM50028009
Synonyms:CHEMBL2322452
TypeSmall organic molecule
Emp. Form.C22H17NO3S
Mol. Mass.375.44
SMILESOc1ccc2cccc(NS(=O)(=O)c3ccc(cc3)-c3ccccc3)c2c1