Reaction Details
TargetOrexin receptor type 2
LigandBDBM50028047
Substrate/Competitorn/a
Meas. Tech.ChEMBL_1433179 (CHEMBL3387579)
Ki 140±n/a nM
Citation Roecker, AJReger, TSMattern, MCMercer, SPBergman, JMSchreier, JDCube, RVCox, CDLi, DLemaire, WBruno, JGHarrell, CMGarson, SLGotter, ALFox, SVStevens, JTannenbaum, PLPrueksaritanont, TCabalu, TDCui, DStellabott, JHartman, GDYoung, SDWinrow, CJRenger, JJColeman, PJ Discovery of MK-3697: a selective orexin 2 receptor antagonist (2-SORA) for the treatment of insomnia. Bioorg Med Chem Lett24:4884-90 (2014) 
 
Orexin receptor type 2
Name:Orexin receptor type 2
Type:Protein
Mol. Mass.:50710.53
Organism:Homo sapiens (Human)
Description:O43614
Residue:444
BDBM50028047
NameBDBM50028047
Synonyms:CHEMBL3338854
TypeSmall organic molecule
Emp. Form.C24H21FN4O3S
Mol. Mass.464.512
SMILESCOc1ccc(CNC(=O)c2sc(nc2-c2cccc(F)c2)-c2cncc(C)c2)nc1OC