Reaction Details
TargetOrexin receptor type 2
LigandBDBM50028037
Substrate/Competitorn/a
Meas. Tech.ChEMBL_1433179 (CHEMBL3387579)
Ki 4.5±n/a nM
Citation Roecker, AJReger, TSMattern, MCMercer, SPBergman, JMSchreier, JDCube, RVCox, CDLi, DLemaire, WBruno, JGHarrell, CMGarson, SLGotter, ALFox, SVStevens, JTannenbaum, PLPrueksaritanont, TCabalu, TDCui, DStellabott, JHartman, GDYoung, SDWinrow, CJRenger, JJColeman, PJ Discovery of MK-3697: a selective orexin 2 receptor antagonist (2-SORA) for the treatment of insomnia. Bioorg Med Chem Lett24:4884-90 (2014) 
 
Orexin receptor type 2
Name:Orexin receptor type 2
Type:Protein
Mol. Mass.:50710.53
Organism:Homo sapiens (Human)
Description:O43614
Residue:444
BDBM50028037
NameBDBM50028037
Synonyms:CHEMBL3338862
TypeSmall organic molecule
Emp. Form.C24H27N5O3
Mol. Mass.433.5029
SMILESCOc1ccc(CNC(=O)c2cc(ncc2N2CCCC2)-c2cncc(C)c2)nc1OC