Reaction Details
TargetOrexin/Hypocretin receptor type 1
LigandBDBM50028058
Substrate/Competitorn/a
Meas. Tech.ChEMBL_1433180 (CHEMBL3387580)
Ki 1500±n/a nM
Citation Roecker, AJReger, TSMattern, MCMercer, SPBergman, JMSchreier, JDCube, RVCox, CDLi, DLemaire, WBruno, JGHarrell, CMGarson, SLGotter, ALFox, SVStevens, JTannenbaum, PLPrueksaritanont, TCabalu, TDCui, DStellabott, JHartman, GDYoung, SDWinrow, CJRenger, JJColeman, PJ Discovery of MK-3697: a selective orexin 2 receptor antagonist (2-SORA) for the treatment of insomnia. Bioorg Med Chem Lett24:4884-90 (2014) 
 
Orexin/Hypocretin receptor type 1
Name:Orexin/Hypocretin receptor type 1
Type:Protein
Mol. Mass.:47554.50
Organism:Homo sapiens (Human)
Description:O43613
Residue:425
BDBM50028058
NameBDBM50028058
Synonyms:CHEMBL3338861
TypeSmall organic molecule
Emp. Form.C24H27N5O4
Mol. Mass.449.5023
SMILESCOc1ccc(CNC(=O)c2cc(ncc2N2CCOCC2)-c2cncc(C)c2)nc1OC