Reaction Details
TargetOrexin receptor type 2
LigandBDBM50028040
Substrate/Competitorn/a
Meas. Tech.ChEMBL_1433181 (CHEMBL3387581)
IC50 13±n/a nM
Citation Roecker, AJReger, TSMattern, MCMercer, SPBergman, JMSchreier, JDCube, RVCox, CDLi, DLemaire, WBruno, JGHarrell, CMGarson, SLGotter, ALFox, SVStevens, JTannenbaum, PLPrueksaritanont, TCabalu, TDCui, DStellabott, JHartman, GDYoung, SDWinrow, CJRenger, JJColeman, PJ Discovery of MK-3697: a selective orexin 2 receptor antagonist (2-SORA) for the treatment of insomnia. Bioorg Med Chem Lett24:4884-90 (2014) 
 
Orexin receptor type 2
Name:Orexin receptor type 2
Type:Protein
Mol. Mass.:50710.53
Organism:Homo sapiens (Human)
Description:O43614
Residue:444
BDBM50028040
NameBDBM50028040
Synonyms:CHEMBL3338846
TypeSmall organic molecule
Emp. Form.C26H24N4O3
Mol. Mass.440.4938
SMILESCOc1ccc(CNC(=O)c2cc(cnc2-c2ccccc2)-c2cncc(C)c2)nc1OC