Reaction Details
TargetOrexin receptor type 2
LigandBDBM50028039
Substrate/Competitorn/a
Meas. Tech.ChEMBL_1433181 (CHEMBL3387581)
IC50 167±n/a nM
Citation Roecker, AJReger, TSMattern, MCMercer, SPBergman, JMSchreier, JDCube, RVCox, CDLi, DLemaire, WBruno, JGHarrell, CMGarson, SLGotter, ALFox, SVStevens, JTannenbaum, PLPrueksaritanont, TCabalu, TDCui, DStellabott, JHartman, GDYoung, SDWinrow, CJRenger, JJColeman, PJ Discovery of MK-3697: a selective orexin 2 receptor antagonist (2-SORA) for the treatment of insomnia. Bioorg Med Chem Lett24:4884-90 (2014) 
 
Orexin receptor type 2
Name:Orexin receptor type 2
Type:Protein
Mol. Mass.:50710.53
Organism:Homo sapiens (Human)
Description:O43614
Residue:444
BDBM50028039
NameBDBM50028039
Synonyms:CHEMBL3338864
TypeSmall organic molecule
Emp. Form.C24H24N6O3
Mol. Mass.444.4858
SMILESCOc1ccc(CNC(=O)c2cc(ncc2-c2cnn(C)c2)-c2cncc(C)c2)nc1OC