Reaction Details
TargetDual specificity tyrosine-phosphorylation-regulated kinase 1A
LigandBDBM50028088
Substrate/Competitorn/a
Meas. Tech.ChEMBL_1434042 (CHEMBL3381514)
IC50 610±n/a nM
Citation Bruel, ABénéteau, RChabanne, MLozach, OLe Guevel, RRavache, MBénédetti, HMeijer, LLogé, CRobert, JM Synthesis of new pyridazino[4,5-b]indol-4-ones and pyridazin-3(2H)-one analogs as DYRK1A inhibitors. Bioorg Med Chem Lett24:5037-40 (2014) 
 
Dual specificity tyrosine-phosphorylation-regulated kinase 1A
Name:Dual specificity tyrosine-phosphorylation-regulated kinase 1A
Type:Enzyme
Mol. Mass.:85616.61
Organism:Homo sapiens (Human)
Description:Q13627
Residue:763
BDBM50028088
NameBDBM50028088
Synonyms:CHEMBL3338893
TypeSmall organic molecule
Emp. Form.C16H14N4O2
Mol. Mass.294.308
SMILESCOc1ccc(Nc2cc(n[nH]c2=O)-c2ccncc2)cc1