Reaction Details
TargetDual specificity tyrosine-phosphorylation-regulated kinase 1A
LigandBDBM50028097
Substrate/Competitorn/a
Meas. Tech.ChEMBL_1434042 (CHEMBL3381514)
IC50 220±n/a nM
Citation Bruel, ABénéteau, RChabanne, MLozach, OLe Guevel, RRavache, MBénédetti, HMeijer, LLogé, CRobert, JM Synthesis of new pyridazino[4,5-b]indol-4-ones and pyridazin-3(2H)-one analogs as DYRK1A inhibitors. Bioorg Med Chem Lett24:5037-40 (2014) 
 
Dual specificity tyrosine-phosphorylation-regulated kinase 1A
Name:Dual specificity tyrosine-phosphorylation-regulated kinase 1A
Type:Enzyme
Mol. Mass.:85616.61
Organism:Homo sapiens (Human)
Description:Q13627
Residue:763
BDBM50028097
NameBDBM50028097
Synonyms:CHEMBL3338888
TypeSmall organic molecule
Emp. Form.C15H11N3O3
Mol. Mass.281.2661
SMILESCOc1ccc2[nH]c3c(c(n[nH]c3=O)-c3ccco3)c2c1