Reaction Details
TargetCeramide glucosyltransferase
LigandBDBM50312527
Substrate/Competitorn/a
Meas. Tech.ChEMBL_1435474 (CHEMBL3384689)
IC50 100±n/a nM
Citation Ghisaidoobe, ATvan den Berg, RJButt, SSStrijland, ADonker-Koopman, WEScheij, Svan den Nieuwendijk, AMKoomen, GJvan Loevezijn, ALeemhuis, MWennekes, Tvan der Stelt, Mvan der Marel, GAvan Boeckel, CAAerts, JMOverkleeft, HS Identification and development of biphenyl substituted iminosugars as improved dual glucosylceramide synthase/neutral glucosylceramidase inhibitors. J Med Chem57:9096-104 (2014) 
 
Ceramide glucosyltransferase
Name:Ceramide glucosyltransferase
Type:PROTEIN
Mol. Mass.:44859.25
Organism:Homo sapiens (Human)
Description:ChEMBL_1435474
Residue:394
BDBM50312527
NameBDBM50312527
Synonyms:CHEMBL1086996 | N-[5-(Adamantan-1-yl-methoxy)-pentyl]-L-ido-1-deoxynojirimycin
TypeSmall organic molecule
Emp. Form.C22H39NO5
Mol. Mass.397.5488
SMILESOC[C@H]1[C@@H](O)[C@H](O)[C@@H](O)CN1CCCCCOCC12CC3CC(CC(C3)C1)C2