Reaction Details
TargetLysosomal acid glucosylceramidase
LigandBDBM50312527
Substrate/Competitorn/a
Meas. Tech.ChEMBL_1435475 (CHEMBL3384690)
IC50 2000±n/a nM
Citation Ghisaidoobe, ATvan den Berg, RJButt, SSStrijland, ADonker-Koopman, WEScheij, Svan den Nieuwendijk, AMKoomen, GJvan Loevezijn, ALeemhuis, MWennekes, Tvan der Stelt, Mvan der Marel, GAvan Boeckel, CAAerts, JMOverkleeft, HS Identification and development of biphenyl substituted iminosugars as improved dual glucosylceramide synthase/neutral glucosylceramidase inhibitors. J Med Chem57:9096-104 (2014) 
 
Lysosomal acid glucosylceramidase
Name:Lysosomal acid glucosylceramidase
Type:Enzyme
Mol. Mass.:59724.64
Organism:Homo sapiens (Human)
Description:The beta-Glu activity was measured with commercially available beta-glucocerebrosidase (Ceredase) as the enzyme source.
Residue:536
BDBM50312527
NameBDBM50312527
Synonyms:CHEMBL1086996 | N-[5-(Adamantan-1-yl-methoxy)-pentyl]-L-ido-1-deoxynojirimycin
TypeSmall organic molecule
Emp. Form.C22H39NO5
Mol. Mass.397.5488
SMILESOC[C@H]1[C@@H](O)[C@H](O)[C@@H](O)CN1CCCCCOCC12CC3CC(CC(C3)C1)C2