Reaction Details
TargetCarbonic anhydrase 2
LigandBDBM50028278
Substrate/Competitorn/a
Meas. Tech.ChEMBL_1436191 (CHEMBL3386553)
Ki 20000±n/a nM
Citation Moeker, JMahon, BPBornaghi, LFVullo, DSupuran, CTMcKenna, RPoulsen, SA Structural insights into carbonic anhydrase IX isoform specificity of carbohydrate-based sulfamates. J Med Chem57:8635-45 (2014) 
 
Carbonic anhydrase 2
Name:Carbonic anhydrase 2
Type:Enzyme
Mol. Mass.:29250.71
Organism:Homo sapiens (Human)
Description:P00918
Residue:260
BDBM50028278
NameBDBM50028278
Synonyms:CHEMBL3342256
TypeSmall organic molecule
Emp. Form.C11H22N2O10S2
Mol. Mass.406.43
SMILESNS(=O)(=O)OC1CCN(CC1)S(=O)(=O)[C@@H]1O[C@H](CO)[C@@H](O)[C@H](O)[C@H]1O