Reaction Details
TargetCarbonic anhydrase 9
LigandBDBM50028278
Substrate/Competitorn/a
Meas. Tech.ChEMBL_1436192 (CHEMBL3386554)
Ki 11±n/a nM
Citation Moeker, JMahon, BPBornaghi, LFVullo, DSupuran, CTMcKenna, RPoulsen, SA Structural insights into carbonic anhydrase IX isoform specificity of carbohydrate-based sulfamates. J Med Chem57:8635-45 (2014) 
 
Carbonic anhydrase 9
Name:Carbonic anhydrase 9
Type:Enzyme
Mol. Mass.:49669.03
Organism:Homo sapiens (Human)
Description:Catalytic domain of human cloned isozyme was used in the assay
Residue:459
BDBM50028278
NameBDBM50028278
Synonyms:CHEMBL3342256
TypeSmall organic molecule
Emp. Form.C11H22N2O10S2
Mol. Mass.406.43
SMILESNS(=O)(=O)OC1CCN(CC1)S(=O)(=O)[C@@H]1O[C@H](CO)[C@@H](O)[C@H](O)[C@H]1O