Reaction Details
TargetCarbonic anhydrase 12
LigandBDBM50028279
Substrate/Competitorn/a
Meas. Tech.ChEMBL_1436193 (CHEMBL3386555)
Ki 21±n/a nM
Citation Moeker, JMahon, BPBornaghi, LFVullo, DSupuran, CTMcKenna, RPoulsen, SA Structural insights into carbonic anhydrase IX isoform specificity of carbohydrate-based sulfamates. J Med Chem57:8635-45 (2014) 
 
Carbonic anhydrase 12
Name:Carbonic anhydrase 12
Type:Enzyme
Mol. Mass.:39456.00
Organism:Homo sapiens (Human)
Description:Catalytic domain of human cloned isozyme was used in the assay
Residue:354
BDBM50028279
NameBDBM50028279
Synonyms:CHEMBL3342255
TypeSmall organic molecule
Emp. Form.C12H26N2O10S2
Mol. Mass.422.472
SMILESNS(=O)(=O)OCCCCCCNS(=O)(=O)[C@@H]1O[C@H](CO)[C@@H](O)[C@H](O)[C@H]1O