Reaction Details
TargetC-X-C chemokine receptor type 2
LigandBDBM50203012
Substrate/Competitorn/a
Meas. Tech.ChEMBL_1436871 (CHEMBL3387793)
IC50 40±n/a nM
Citation Maeda, DYPeck, AMSchuler, ADQuinn, MTKirpotina, LNWicomb, WNFan, GHZebala, JA Discovery of 2-[5-(4-Fluorophenylcarbamoyl)pyridin-2-ylsulfanylmethyl]phenylboronic Acid (SX-517): Noncompetitive Boronic Acid Antagonist of CXCR1 and CXCR2. J Med Chem57:8378-97 (2014) 
 
C-X-C chemokine receptor type 2
Name:C-X-C chemokine receptor type 2
Type:Protein
Mol. Mass.:40767.88
Organism:Homo sapiens (Human)
Description:P25025
Residue:360
BDBM50203012
NameBDBM50203012
Synonyms:1-(2-bromophenyl)-3-(2-hydroxy-4-nitrophenyl)urea SB-225002
TypeSmall organic molecule
Emp. Form.C13H10BrN3O4
Mol. Mass.352.14
SMILESOc1cc(ccc1NC(=O)Nc1ccccc1Br)[N+]([O-])=O