Reaction Details
TargetcAMP-specific 3',5'-cyclic phosphodiesterase 4B
LigandBDBM14361
Substrate/Competitorn/a
Meas. Tech.ChEMBL_1432327 (CHEMBL3383871)
IC50 98±n/a nM
Citation García, AMBrea, JMorales-García, JAPerez, DIGonzález, AAlonso-Gil, SGracia-Rubio, IRos-Simó, CConde, SCadavid, MILoza, MIPerez-Castillo, AValverde, OMartinez, AGil, C Modulation of cAMP-specific PDE without emetogenic activity: new sulfide-like PDE7 inhibitors. J Med Chem57:8590-607 (2014) 
 
cAMP-specific 3',5'-cyclic phosphodiesterase 4B
Name:cAMP-specific 3',5'-cyclic phosphodiesterase 4B
Type:Protein
Mol. Mass.:83318.87
Organism:Homo sapiens (Human)
Description:Q07343
Residue:736
BDBM14361
NameBDBM14361
Synonyms:(R,S)-Rolipram 4-[3-(cyclopentyloxy)-4-methoxyphenyl]pyrrolidin-2-one CHEMBL63 | Rolipram
TypeSmall organic molecule
Emp. Form.C16H21NO3
Mol. Mass.275.3428
SMILESCOc1ccc(cc1OC1CCCC1)C1CNC(=O)C1