Reaction Details
TargetHigh affinity cAMP-specific 3',5'-cyclic phosphodiesterase 7A
LigandBDBM50028899
Substrate/Competitorn/a
Meas. Tech.ChEMBL_1432320 (CHEMBL3383864)
IC50 9270±n/a nM
Citation García, AMBrea, JMorales-García, JAPerez, DIGonzález, AAlonso-Gil, SGracia-Rubio, IRos-Simó, CConde, SCadavid, MILoza, MIPerez-Castillo, AValverde, OMartinez, AGil, C Modulation of cAMP-specific PDE without emetogenic activity: new sulfide-like PDE7 inhibitors. J Med Chem57:8590-607 (2014) 
 
High affinity cAMP-specific 3',5'-cyclic phosphodiesterase 7A
Name:High affinity cAMP-specific 3',5'-cyclic phosphodiesterase 7A
Type:Enzyme
Mol. Mass.:55514.96
Organism:Homo sapiens (Human)
Description:Q13946
Residue:482
BDBM50028899
NameBDBM50028899
Synonyms:CHEMBL3359098
TypeSmall organic molecule
Emp. Form.C13H9F3N2O2S
Mol. Mass.314.283
SMILESNc1ccc(Sc2ccc(cc2C(F)(F)F)[N+]([O-])=O)cc1