Reaction Details
TargetcAMP-specific 3',5'-cyclic phosphodiesterase 4D
LigandBDBM50028887
Substrate/Competitorn/a
Meas. Tech.ChEMBL_1432325 (CHEMBL3383869)
IC50 3000±n/a nM
Citation García, AMBrea, JMorales-García, JAPerez, DIGonzález, AAlonso-Gil, SGracia-Rubio, IRos-Simó, CConde, SCadavid, MILoza, MIPerez-Castillo, AValverde, OMartinez, AGil, C Modulation of cAMP-specific PDE without emetogenic activity: new sulfide-like PDE7 inhibitors. J Med Chem57:8590-607 (2014) 
 
cAMP-specific 3',5'-cyclic phosphodiesterase 4D
Name:cAMP-specific 3',5'-cyclic phosphodiesterase 4D
Type:Protein
Mol. Mass.:91092.69
Organism:Homo sapiens (Human)
Description:Q08499
Residue:809
BDBM50028887
NameBDBM50028887
Synonyms:CHEMBL3359635
TypeSmall organic molecule
Emp. Form.C11H7ClN2O2S
Mol. Mass.266.703
SMILES[O-][N+](=O)c1cc(Cl)ccc1Sc1ccncc1