Reaction Details
TargetAurora kinase A
LigandBDBM50029432
Substrate/Competitorn/a
Meas. Tech.ChEMBL_1436940 (CHEMBL3388438)
IC50 468±n/a nM
Citation Cai, JLi, LHong, KHWu, XChen, JWang, PCao, MZong, XJi, M Discovery of 4-aminoquinazoline--urea derivatives as Aurora kinase inhibitors with antiproliferative activity. Bioorg Med Chem22:5813-23 (2014) 
 
Aurora kinase A
Name:Aurora kinase A
Type:Serine/threonine-protein kinase
Mol. Mass.:45830.98
Organism:Homo sapiens (Human)
Description:O14965
Residue:403
BDBM50029432
NameBDBM50029432
Synonyms:CHEMBL3343315
TypeSmall organic molecule
Emp. Form.C29H36N6O3
Mol. Mass.516.6345
SMILESCCN(CCO)CCCOC1=CC2N=CN=C(Nc3ccc(NC(=O)NCc4ccccc4)cc3)C2C=C1