Reaction Details
TargetAurora kinase B
LigandBDBM50029423
Substrate/Competitorn/a
Meas. Tech.ChEMBL_1436941 (CHEMBL3388439)
IC50 292±n/a nM
Citation Cai, JLi, LHong, KHWu, XChen, JWang, PCao, MZong, XJi, M Discovery of 4-aminoquinazoline--urea derivatives as Aurora kinase inhibitors with antiproliferative activity. Bioorg Med Chem22:5813-23 (2014) 
 
Aurora kinase B
Name:Aurora kinase B
Type:Protein
Mol. Mass.:39327.72
Organism:Homo sapiens (Human)
Description:Q96GD4
Residue:344
BDBM50029423
NameBDBM50029423
Synonyms:CHEMBL3343312
TypeSmall organic molecule
Emp. Form.C31H36N6O2
Mol. Mass.524.6565
SMILESCC1CCN(CCCOc2ccc3c(Nc4ccc(NC(=O)NCc5ccccc5)cc4)ncnc3c2)CC1