Reaction Details
TargetAurora kinase B
LigandBDBM50029454
Substrate/Competitorn/a
Meas. Tech.ChEMBL_1436941 (CHEMBL3388439)
IC50 181±n/a nM
Citation Cai, JLi, LHong, KHWu, XChen, JWang, PCao, MZong, XJi, M Discovery of 4-aminoquinazoline--urea derivatives as Aurora kinase inhibitors with antiproliferative activity. Bioorg Med Chem22:5813-23 (2014) 
 
Aurora kinase B
Name:Aurora kinase B
Type:Protein
Mol. Mass.:39327.72
Organism:Homo sapiens (Human)
Description:Q96GD4
Residue:344
BDBM50029454
NameBDBM50029454
Synonyms:CHEMBL3343418
TypeSmall organic molecule
Emp. Form.C28H38N6O2
Mol. Mass.490.6403
SMILESO=C(NC1CCCCC1)Nc1ccc(NC2=NC=NC3C=C(OCCCN4CCCC4)C=CC23)cc1