Reaction Details
TargetAurora kinase A
LigandBDBM50029459
Substrate/Competitorn/a
Meas. Tech.ChEMBL_1436943 (CHEMBL3388441)
IC50 110±n/a nM
Citation Cai, JLi, LHong, KHWu, XChen, JWang, PCao, MZong, XJi, M Discovery of 4-aminoquinazoline--urea derivatives as Aurora kinase inhibitors with antiproliferative activity. Bioorg Med Chem22:5813-23 (2014) 
 
Aurora kinase A
Name:Aurora kinase A
Type:Serine/threonine-protein kinase
Mol. Mass.:45830.98
Organism:Homo sapiens (Human)
Description:O14965
Residue:403
BDBM50029459
NameBDBM50029459
Synonyms:CHEMBL3343420
TypeSmall organic molecule
Emp. Form.C29H33N5O4
Mol. Mass.515.6034
SMILESCOC1=CC2C(C=C1OCCCN1CCOCC1)N=CN=C2Nc1ccc(NC(=O)c2ccccc2)cc1