Reaction Details
TargetSalicylate synthetase, Irp9
LigandBDBM50030319
Substrate/Competitorn/a
Meas. Tech.ChEMBL_1431486 (CHEMBL3389851)
IC50 160000±n/a nM
Citation Meneely, KMLuo, QRiley, APTaylor, BRoy, AStein, RLPrisinzano, TELamb, AL Expanding the results of a high throughput screen against an isochorismate-pyruvate lyase to enzymes of a similar scaffold or mechanism. Bioorg Med Chem22:5961-9 (2014) 
 
Salicylate synthetase, Irp9
Name:Salicylate synthetase, Irp9
Type:PROTEIN
Mol. Mass.:47967.20
Organism:Yersinia enterocolitica
Description:ChEMBL_109499
Residue:434
BDBM50030319
NameBDBM50030319
Synonyms:CHEMBL3343826
TypeSmall organic molecule
Emp. Form.C9H4ClNO7S
Mol. Mass.305.649
SMILESCOC(=O)Oc1c(Cl)cc2oc(=O)sc2c1[N+]([O-])=O