Reaction Details
TargetNuclear receptor ROR-gamma
LigandBDBM50445877
Substrate/Competitorn/a
Meas. Tech.ChEMBL_1434909 (CHEMBL3385303)
IC50 10.0±n/a nM
Citation Gege, CSchlüter, THoffmann, T Identification of the first inverse agonist of retinoid-related orphan receptor (ROR) with dual selectivity for RORß and ROR¿t. Bioorg Med Chem Lett24:5265-7 (2014) 
 
Nuclear receptor ROR-gamma
Name:Nuclear receptor ROR-gamma
Type:Enzyme Catalytic Domain
Mol. Mass.:58218.40
Organism:Homo sapiens (Human)
Description:P51449
Residue:518
BDBM50445877
NameBDBM50445877
Synonyms:CHEMBL3105681
TypeSmall organic molecule
Emp. Form.C26H20Cl2N2O4S2
Mol. Mass.559.484
SMILESCCS(=O)(=O)c1ccc(CC(=O)Nc2nc(c(s2)C(=O)c2ccccc2Cl)-c2cccc(Cl)c2)cc1