Reaction Details
TargetBroad substrate specificity ATP-binding cassette transporter ABCG2
LigandBDBM81939
Substrate/Competitorn/a
Meas. Tech.ChEMBL_1437089 (CHEMBL3381103)
EC50 37300±n/a nM
Citation Krauze, AGrinberga, SKrasnova, LAdlere, ISokolova, EDomracheva, IShestakova, IAndzans, ZDuburs, G Thieno[2,3-b]pyridines--a new class of multidrug resistance (MDR) modulators. Bioorg Med Chem22:5860-70 (2014) 
 
Broad substrate specificity ATP-binding cassette transporter ABCG2
Name:Broad substrate specificity ATP-binding cassette transporter ABCG2
Type:Multi-pass membrane protein; monomer or homodimer; disulfide-linked
Mol. Mass.:72329.48
Organism:Homo sapiens (Human)
Description:Q9UNQ0
Residue:655
BDBM81939
NameBDBM81939
Synonyms:CAS_52-53-9 VERAPAMIL
TypeSmall organic molecule
Emp. Form.C27H38N2O4
Mol. Mass.454.6016
SMILESCOc1ccc(CCN(C)CCCC(C#N)(C(C)C)c2ccc(OC)c(OC)c2)cc1OC