Reaction Details
TargetTransthyretin
LigandBDBM32020
Substrate/Competitorn/a
Meas. Tech.ChEMBL_1442420 (CHEMBL3380050)
EC50 8500±n/a nM
Citation Yokoyama, TKosaka, YMizuguchi, M Inhibitory activities of propolis and its promising component, caffeic acid phenethyl ester, against amyloidogenesis of human transthyretin. J Med Chem57:8928-35 (2014) 
 
Transthyretin
Name:Transthyretin
Type:Enzyme
Mol. Mass.:15884.31
Organism:Homo sapiens (Human)
Description:P02766
Residue:147
BDBM32020
NameBDBM32020
Synonyms:4-[4-(3,4-dihydroxyphenyl)-2,3-dimethyl-butyl]pyrocatechol 4-[4-[3,4-bis(oxidanyl)phenyl]-2,3-dimethyl-butyl]benzene-1,2-diol CHEMBL52 MLS000069451 Nordihydroguaiaretic acid (NDGA) US10857082, Compound 2.18 | cid_4534
TypeSmall organic molecule
Emp. Form.C18H22O4
Mol. Mass.302.3649
SMILESCC(Cc1ccc(O)c(O)c1)C(C)Cc1ccc(O)c(O)c1