Reaction Details
TargetTranscription initiation factor TFIID subunit 1
LigandBDBM50030894
Substrate/Competitorn/a
Meas. Tech.ChEMBL_1442442 (CHEMBL3380072)
Kd 560±n/a nM
Citation McKeown, MRShaw, DLFu, HLiu, SXu, XMarineau, JJHuang, YZhang, XBuckley, DLKadam, AZhang, ZBlacklow, SCQi, JZhang, WBradner, JE Biased multicomponent reactions to develop novel bromodomain inhibitors. J Med Chem57:9019-27 (2014) 
 
Transcription initiation factor TFIID subunit 1
Name:Transcription initiation factor TFIID subunit 1
Type:PROTEIN
Mol. Mass.:212598.75
Organism:Homo sapiens (Human)
Description:ChEMBL_108248
Residue:1872
BDBM50030894
NameBDBM50030894
Synonyms:CHEMBL3356559
TypeSmall organic molecule
Emp. Form.C21H23N5O
Mol. Mass.361.4402
SMILESCc1noc(C)c1-c1ccc(cc1)-c1nc2cnccn2c1NC(C)(C)C