Reaction Details
TargetTranscription initiation factor TFIID subunit 1-like
LigandBDBM50030894
Substrate/Competitorn/a
Meas. Tech.ChEMBL_1442443 (CHEMBL3380073)
Kd 1300±n/a nM
Citation McKeown, MRShaw, DLFu, HLiu, SXu, XMarineau, JJHuang, YZhang, XBuckley, DLKadam, AZhang, ZBlacklow, SCQi, JZhang, WBradner, JE Biased multicomponent reactions to develop novel bromodomain inhibitors. J Med Chem57:9019-27 (2014) 
 
Transcription initiation factor TFIID subunit 1-like
Name:Transcription initiation factor TFIID subunit 1-like
Type:PROTEIN
Mol. Mass.:207253.07
Organism:Homo sapiens (Human)
Description:ChEMBL_108001
Residue:1826
BDBM50030894
NameBDBM50030894
Synonyms:CHEMBL3356559
TypeSmall organic molecule
Emp. Form.C21H23N5O
Mol. Mass.361.4402
SMILESCc1noc(C)c1-c1ccc(cc1)-c1nc2cnccn2c1NC(C)(C)C